A test failure

Added by hooddxwd 8 months ago

I was installing the Source and following this page: https://www.libavg.de/site/projects/libavg/wiki/UbuntuSourceInstall
When I run the "make check", it shows as follows:

FAILED (failures=1)
Skipped 2 tests:

mpeg1-48x48.mov
mjpeg-48x48.avi
rgba-48x48.mov
testHinting (WordsTest.WordsTestCase): Linux support requires modified font config

and:

86% tests passed, 1 tests failed out of 7

Total Test time (real) = 6.39 sec

The following tests FAILED:
1 - python_test (Failed)
Errors while running CTest
CMakeFiles/check.dir/build.make:57: recipe for target 'CMakeFiles/check' failed
make3: * [CMakeFiles/check] Error 8
CMakeFiles/Makefile2:67: recipe for target 'CMakeFiles/check.dir/all' failed
make2:
[CMakeFiles/check.dir/all] Error 2
CMakeFiles/Makefile2:74: recipe for target 'CMakeFiles/check.dir/rule' failed
make1:
[CMakeFiles/check.dir/rule] Error 2
Makefile:173: recipe for target 'check' failed
make: *
[check] Error 2

Would you mind telling me, how can I fix this?


Replies (3)

RE: A test failure - Added by coder 8 months ago

Hi hooddxwd,

the tests should have shown a lot more output. Can you paste all of it so I can see what's going on? Also, please try to format the output so it's all in one monospaced font - that makes our work a lot easier.

Cheers, Uli

RE: A test failure - Added by hooddxwd 8 months ago

ok, it is shown as follows:

Test project /home/hood/KP/libavg/build
Start 1: python_test
1/7 Test #1: python_test ......................***Failed 7.91 sec
[17-04-25 20:21:51.788][INFO][......APP] : Using libavg from: ../../libavg
[17-04-25 20:21:52.110][INFO][...CONFIG] : Display bpp: 24
[17-04-25 20:21:52.110][INFO][...CONFIG] : Requested OpenGL configuration:
[17-04-25 20:21:52.110][INFO][...CONFIG] : OpenGL flavor: Desktop
[17-04-25 20:21:52.110][INFO][...CONFIG] : Pixel buffers: true
[17-04-25 20:21:52.110][INFO][...CONFIG] : Power of 2 textures: false
[17-04-25 20:21:52.110][INFO][...CONFIG] : No multisampling
[17-04-25 20:21:52.110][INFO][...CONFIG] : Shader usage: auto
[17-04-25 20:21:52.110][INFO][...CONFIG] : Debug context: true
[17-04-25 20:21:52.126][INFO][...CONFIG] : Loading shaders from /home/hood/KP/libavg/build/python/libavg/shaders
[17-04-25 20:21:52.161][INFO][...CONFIG] : OpenGL configuration:
[17-04-25 20:21:52.161][INFO][...CONFIG] : OpenGL version: 3.0 Mesa 12.0.6
[17-04-25 20:21:52.161][INFO][...CONFIG] : OpenGL vendor: Intel Open Source Technology Center
[17-04-25 20:21:52.161][INFO][...CONFIG] : OpenGL renderer: Mesa DRI Intel(R) Haswell Mobile
[17-04-25 20:21:52.162][INFO][...CONFIG] : OpenGL flavor: Desktop
[17-04-25 20:21:52.162][INFO][...CONFIG] : Pixel buffers: true
[17-04-25 20:21:52.162][INFO][...CONFIG] : Power of 2 textures: false
[17-04-25 20:21:52.162][INFO][...CONFIG] : No multisampling
[17-04-25 20:21:52.162][INFO][...CONFIG] : Shader usage: full
[17-04-25 20:21:52.162][INFO][...CONFIG] : Debug context: true
[17-04-25 20:21:52.162][INFO][...CONFIG] : Using pixel buffer objects
[17-04-25 20:21:52.162][INFO][...CONFIG] : Max. texture size: 8192
[17-04-25 20:21:52.162][INFO][...CONFIG] : GPU-based YUV-RGB conversion: yes.
[17-04-25 20:21:52.173][.ERR][...CONFIG] : Dedicated video memory: Unknown
[17-04-25 20:21:52.173][.ERR][...CONFIG] : Video memory used at start: Unknown
[17-04-25 20:21:52.173][INFO][...CONFIG] : Vertical Refresh Rate: 60
[17-04-25 20:21:52.173][INFO][...CONFIG] : Pixels per mm: 3.77953
testPoint (PlayerTest.PlayerTestCase) ... ok
testColor (PlayerTest.PlayerTestCase) ... ok
testBasics (PlayerTest.PlayerTestCase) ... ok
testSetResolution (PlayerTest.PlayerTestCase) ... ok
testColorParse (PlayerTest.PlayerTestCase) ... ok
testFakeTime (PlayerTest.PlayerTestCase) ... ok
testDivResize (PlayerTest.PlayerTestCase) ... ok
testRotate (PlayerTest.PlayerTestCase) ... ok
testRotate2 (PlayerTest.PlayerTestCase) ... ok
testRotatePivot (PlayerTest.PlayerTestCase) ... ok
testOpacity (PlayerTest.PlayerTestCase) ... ok
testOutlines (PlayerTest.PlayerTestCase) ... ok
testWordsOutlines (PlayerTest.PlayerTestCase) ... ok
testError (PlayerTest.PlayerTestCase) ... ok
testExceptionInTimeout (PlayerTest.PlayerTestCase) ... ok
testInvalidImageFilename (PlayerTest.PlayerTestCase) ... ok
testInvalidVideoFilename (PlayerTest.PlayerTestCase) ... ok
testTimeouts (PlayerTest.PlayerTestCase) ... ok
testTimeoutOnFrameHandling (PlayerTest.PlayerTestCase) ... ok
testCallFromThread (PlayerTest.PlayerTestCase) ... ok
testAVGFile (PlayerTest.PlayerTestCase) ... ok
testBroken (PlayerTest.PlayerTestCase) ... ok
testMove (PlayerTest.PlayerTestCase) ... ok
testCropImage (PlayerTest.PlayerTestCase) ... ok
testCropMovie (PlayerTest.PlayerTestCase) ... ok
testWarp (PlayerTest.PlayerTestCase) ... ok
testMediaDir (PlayerTest.PlayerTestCase) ... ok
testMemoryQuery (PlayerTest.PlayerTestCase) ... ok
testStopOnEscape (PlayerTest.PlayerTestCase) ... ok
testScreenDimensions (PlayerTest.PlayerTestCase) ... ok
testSVG (PlayerTest.PlayerTestCase) ... ok
testGetConfigOption (PlayerTest.PlayerTestCase) ... ok
testValidateXml (PlayerTest.PlayerTestCase) ... ok
testSetWindowTitle (PlayerTest.PlayerTestCase) ... ok
testWindowFrame (PlayerTest.PlayerTestCase) ... ok
testImageHRef (ImageTest.ImageTestCase) ... ok
testImagePos (ImageTest.ImageTestCase) ... ok
testImageSize (ImageTest.ImageTestCase) ... ok
testImageCache (ImageTest.ImageTestCase) ... ok
testBitmap (ImageTest.ImageTestCase) ... ok
testBitmapManager (ImageTest.ImageTestCase) ...
Multithread: False
Multithread: True
ok
testBitmapManagerException (ImageTest.ImageTestCase) ... ok
testBlendMode (ImageTest.ImageTestCase) ... ok
testImageMask (ImageTest.ImageTestCase) ... ok
testImageMaskCanvas (ImageTest.ImageTestCase) ... ok
testImageMaskPos (ImageTest.ImageTestCase) ... ok
testImageMipmap (ImageTest.ImageTestCase) ... ok
testImageCompression (ImageTest.ImageTestCase) ... ok
testSpline (ImageTest.ImageTestCase) ... ok
testLine (VectorTest.VectorTestCase) ... ok
testLotsOfLines (VectorTest.VectorTestCase) ... ok
testLineOpacity (VectorTest.VectorTestCase) ... ok
testTexturedLine (VectorTest.VectorTestCase) ... ok
testRect (VectorTest.VectorTestCase) ... ok
testRectEvents (VectorTest.VectorTestCase) ... ok
testTexturedRect (VectorTest.VectorTestCase) ... ok
testCurve (VectorTest.VectorTestCase) ... ok
testCurveEvents (VectorTest.VectorTestCase) ... ok
testTexturedCurve (VectorTest.VectorTestCase) ... ok
testPolyLine (VectorTest.VectorTestCase) ... ok
testTexturedPolyLine (VectorTest.VectorTestCase) ... ok
testPolygon (VectorTest.VectorTestCase) ... ok
testPolygonInDiv (VectorTest.VectorTestCase) ... ok
testPolygonEvents (VectorTest.VectorTestCase) ... ok
testTexturedPolygon (VectorTest.VectorTestCase) ... ok
testPointInPolygon (VectorTest.VectorTestCase) ... ok
testCircle (VectorTest.VectorTestCase) ... ok
testMesh (VectorTest.VectorTestCase) ... ok
testInactiveVector (VectorTest.VectorTestCase) ... ok
testSimpleWords (WordsTest.WordsTestCase) ...
testSimpleWords: Difference image has avg=4.64, std dev=28.01
ok
testRedrawOnDemand (WordsTest.WordsTestCase) ... ok
testFontStyle (WordsTest.WordsTestCase) ...
testFontStyle1: Difference image has avg=4.64, std dev=27.96

testFontStyle2: Difference image has avg=3.01, std dev=21.55
ok
testBaseStyle (WordsTest.WordsTestCase) ... ok
testGlyphPos (WordsTest.WordsTestCase) ... ok
testParaWords (WordsTest.WordsTestCase) ...
testParaWords: Difference image has avg=22.90, std dev=59.01
ok
testJustify (WordsTest.WordsTestCase) ...
testJustify: Difference image has avg=10.00, std dev=40.72
ok
testWrapMode (WordsTest.WordsTestCase) ...
testWrapMode1: Difference image has avg=15.43, std dev=49.97
testWrapMode2: Difference image has avg=21.07, std dev=57.37
testWrapMode3: Difference image has avg=15.43, std dev=49.97
testWrapMode4: Difference image has avg=23.28, std dev=60.29
ok
testWordsMask (WordsTest.WordsTestCase) ...
testWordsMask1: Difference image has avg=13.61, std dev=38.84
testWordsMask2: Difference image has avg=17.59, std dev=43.61
testWordsMask3: Difference image has avg=11.73, std dev=36.56
testWordsMask4: Difference image has avg=5.85, std dev=18.24
testWordsMask5: Difference image has avg=5.91, std dev=18.40
testWordsMask6: Difference image has avg=9.18, std dev=18.82
ok
testHinting (WordsTest.WordsTestCase) ... skipping: Linux support requires modified font config ... ok
testSpanWords (WordsTest.WordsTestCase) ...
testSpanWords: Difference image has avg=2.52, std dev=19.59
testSpanWords: Difference image has avg=2.52, std dev=19.59
testSpanWords: Difference image has avg=2.52, std dev=19.59
ok
testDynamicWords (WordsTest.WordsTestCase) ...
testDynamicWords1: Difference image has avg=0.59, std dev=9.65
testDynamicWords2: Difference image has avg=0.69, std dev=10.78
ok
testI18NWords (WordsTest.WordsTestCase) ...
testI18NWords1: Difference image has avg=8.36, std dev=37.62
testI18NWords2: Difference image has avg=11.11, std dev=42.57
testI18NWords3: Difference image has avg=13.58, std dev=46.66
ok
testRawText (WordsTest.WordsTestCase) ...
testRawText1: Difference image has avg=4.06, std dev=24.63
testRawText2: Difference image has avg=10.41, std dev=39.11
testRawText3: Difference image has avg=12.08, std dev=41.47
testRawText4: Difference image has avg=7.47, std dev=32.56
ok
testWordsBR (WordsTest.WordsTestCase) ...
testWordsBR: Difference image has avg=4.91, std dev=29.05
testWordsBR: Difference image has avg=4.91, std dev=29.05
ok
testLetterSpacing (WordsTest.WordsTestCase) ...
testLetterSpacing1: Difference image has avg=5.23, std dev=29.47
testLetterSpacing2: Difference image has avg=5.10, std dev=29.29
ok
testPositioning (WordsTest.WordsTestCase) ...
testPositioning: Difference image has avg=7.16, std dev=33.58
ok
testFontDir (WordsTest.WordsTestCase) ...
testFontDir: Difference image has avg=3.50, std dev=20.44
ok
testGetNumLines (WordsTest.WordsTestCase) ... ok
testGetLineExtents (WordsTest.WordsTestCase) ... ok
testGetCharIndexFromPos (WordsTest.WordsTestCase) ... ok
testGetTextAsDisplayed (WordsTest.WordsTestCase) ... ok
testSetWidth (WordsTest.WordsTestCase) ... ok
testTooWide (WordsTest.WordsTestCase) ... ok
testWordsGamma (WordsTest.WordsTestCase) ...
testWordsGamma1: Difference image has avg=7.96, std dev=35.01
testWordsGamma2: Difference image has avg=8.38, std dev=36.66
ok
testImgDynamics (DynamicsTest.DynamicsTestCase) ... ok
testVideoDynamics (DynamicsTest.DynamicsTestCase) ... ok
testWordsDynamics (DynamicsTest.DynamicsTestCase) ...
testWordsDynamics1: Difference image has avg=0.88, std dev=12.54
testWordsDynamics2: Difference image has avg=1.77, std dev=17.69
testWordsDynamics3: Difference image has avg=1.77, std dev=17.69
testWordsDynamics5: Difference image has avg=0.88, std dev=12.54
testWordsDynamics1: Difference image has avg=0.88, std dev=12.54
testWordsDynamics2: Difference image has avg=1.77, std dev=17.69
testWordsDynamics3: Difference image has avg=1.77, std dev=17.69
testWordsDynamics5: Difference image has avg=0.88, std dev=12.54
ok
testDivDynamics (DynamicsTest.DynamicsTestCase) ... ok
testEventBubbling (DynamicsTest.DynamicsTestCase) ... ok
testDuplicateID (DynamicsTest.DynamicsTestCase) ... ok
testChangeParentError (DynamicsTest.DynamicsTestCase) ... ok
testDynamicEventCapture (DynamicsTest.DynamicsTestCase) ... ok
testComplexDiv (DynamicsTest.DynamicsTestCase) ... ok
testNodeCustomization (DynamicsTest.DynamicsTestCase) ... ok
testDynamicMediaDir (DynamicsTest.DynamicsTestCase) ... ok
testKeyEvents (EventTest.EventTestCase) ... ok
testSimpleEvents (EventTest.EventTestCase) ... ok
testTangibleEvents (EventTest.EventTestCase) ... ok
testTilted (EventTest.EventTestCase) ... ok
testWordsClicks (EventTest.EventTestCase) ... ok
testDivEvents (EventTest.EventTestCase) ... ok
testDivNegativePos (EventTest.EventTestCase) ... ok
testUnlinkInHandler (EventTest.EventTestCase) ... ok
testConnectHandler (EventTest.EventTestCase) ... ok
testPublisher (EventTest.EventTestCase) ... ok
testComplexPublisher (EventTest.EventTestCase) ... ok
testPublisherAutoDelete (EventTest.EventTestCase) ... ok
testPublisherNestedUnsubscribe (EventTest.EventTestCase) ... ok
testObscuringEvents (EventTest.EventTestCase) ... ok
testSensitive (EventTest.EventTestCase) ... ok
testChangingHandlers (EventTest.EventTestCase) ... ok
testEventCapture (EventTest.EventTestCase) ... ok
testMouseOver (EventTest.EventTestCase) ... ok
testMouseDisable (EventTest.EventTestCase) ... ok
testMouseWheel (EventTest.EventTestCase) ... ok
testEventErr (EventTest.EventTestCase) ... ok
testEventHook (EventTest.EventTestCase) ... ok
testException (EventTest.EventTestCase) ... ok
testContacts (EventTest.EventTestCase) ... ok
testContactRegistration (EventTest.EventTestCase) ... ok
testMultiContactRegistration (EventTest.EventTestCase) ... ok
testPlaybackMessages (EventTest.EventTestCase) ... ok
testImageSizeChanged (EventTest.EventTestCase) ... ok
testWordsSizeChanged (EventTest.EventTestCase) ... ok
testVideoSizeChanged (EventTest.EventTestCase) ... ok
testRectSizeChanged (EventTest.EventTestCase) ... ok
testDivSizeChanged (EventTest.EventTestCase) ... ok
testSound (AVTest.AVTestCase) ... ok
testSoundInfo (AVTest.AVTestCase) ... ok
testSoundSeek (AVTest.AVTestCase) ... ok
testBrokenSound (AVTest.AVTestCase) ... ok
testSoundEOF (AVTest.AVTestCase) ... ok
testVideoInfo (AVTest.AVTestCase) ...
Threaded: False
Threaded: True
Nonstandard queue length
ok
testVideoFiles (AVTest.AVTestCase) ...
mjpeg-48x48.avi
threaded: False
threaded: True
mpeg1-48x48.mov
threaded: False
threaded: True
rgba-48x48.mov
threaded: False
threaded: True
h264-48x48.h264
threaded: False
threaded: True
vp6a-yuva-48x48.flv
threaded: False
threaded: True
ok
testPlayBeforeConnect (AVTest.AVTestCase) ... ok
testVideoState (AVTest.AVTestCase) ... ok
testVideoActive (AVTest.AVTestCase) ... ok
testVideoHRef (AVTest.AVTestCase) ... ok
testVideoOpacity (AVTest.AVTestCase) ... ok
testVideoSeek (AVTest.AVTestCase) ... ok
testVideoFPS (AVTest.AVTestCase) ... ok
testLoop (AVTest.AVTestCase) ... ok
testVideoMask (AVTest.AVTestCase) ... ok
testVideoEOF (AVTest.AVTestCase) ... ok
testVideoSeekAfterEOF (AVTest.AVTestCase) ... ok
testException (AVTest.AVTestCase) ... ok
testVideoWriter (AVTest.AVTestCase) ... ok
test2VideosAtOnce (AVTest.AVTestCase) ... ok
testCanvasBasics (OffscreenTest.OffscreenTestCase) ... ok
testCanvasLoadAfterPlay (OffscreenTest.OffscreenTestCase) ... ok
testCanvasResize (OffscreenTest.OffscreenTestCase) ... ok
testCanvasErrors (OffscreenTest.OffscreenTestCase) ... ok
testCanvasAPI (OffscreenTest.OffscreenTestCase) ... ok
testCanvasEvents (OffscreenTest.OffscreenTestCase) ... ok
testCanvasDrag (OffscreenTest.OffscreenTestCase) ... ok
testCanvasEventCapture (OffscreenTest.OffscreenTestCase) ... ok
testCanvasRender (OffscreenTest.OffscreenTestCase) ... ok
testCanvasAutoRender (OffscreenTest.OffscreenTestCase) ... ok
testCanvasCrop (OffscreenTest.OffscreenTestCase) ... ok
testCanvasAlpha (OffscreenTest.OffscreenTestCase) ... ok
testCanvasBackface (OffscreenTest.OffscreenTestCase) ... ok
testCanvasBlendModes (OffscreenTest.OffscreenTestCase) ... ok
testCanvasMultisampling (OffscreenTest.OffscreenTestCase) ... FAIL
testCanvasMipmap (OffscreenTest.OffscreenTestCase) ... ok
testCanvasDependencies (OffscreenTest.OffscreenTestCase) ... ok
testImageNullFX (FXTest.FXTestCase) ... ok
testVideoNullFX (FXTest.FXTestCase) ... ok
testWordsNullFX (FXTest.FXTestCase) ... ok
testCanvasNullFX (FXTest.FXTestCase) ... ok
testNodeInCanvasNullFX (FXTest.FXTestCase) ... ok
testRenderPipeline (FXTest.FXTestCase) ...
False False False False
False False False True
False False True False
False False True True
False True False False
False True False True
False True True False
False True True True
True False False False
True False False True
True False True False
True False True True
True True False False
True True False True
True True True False
True True True True
ok
testBlurFX (FXTest.FXTestCase) ... ok
testHueSatFX (FXTest.FXTestCase) ... ok
testInvertFX (FXTest.FXTestCase) ... ok
testShadowFX (FXTest.FXTestCase) ... ok
testWordsShadowFX (FXTest.FXTestCase) ... ok
testGamma (FXTest.FXTestCase) ... ok
testIntensity (FXTest.FXTestCase) ... ok
testWordsIntensity (FXTest.FXTestCase) ...
testWordsIntensity: Difference image has avg=2.25, std dev=13.70
ok
testContrast (FXTest.FXTestCase) ... ok
testFXUpdate (FXTest.FXTestCase) ... ok
testChromaKeyFX (FXTest.FXTestCase) ... ok
testRoundedRect (PythonTest.PythonTestCase) ... ok
testPieSlice (PythonTest.PythonTestCase) ... ok
testArc (PythonTest.PythonTestCase) ... ok
testStateMachine (PythonTest.PythonTestCase) ... ok
testStateMachineDiagram (PythonTest.PythonTestCase) ... ok
testPersistStore (PythonTest.PythonTestCase) ... ok
testPersistCorrupted (PythonTest.PythonTestCase) ... ok
testPersistValidation (PythonTest.PythonTestCase) ... ok
testSprite (PythonTest.PythonTestCase) ... ok
testSpriteErrors (PythonTest.PythonTestCase) ... ok
testLinearAnim (AnimTest.AnimTestCase) ... ok
testAnimRegistry (AnimTest.AnimTestCase) ... ok
testFadeIn (AnimTest.AnimTestCase) ... ok
testFadeOut (AnimTest.AnimTestCase) ... ok
testNonExistentAttributeAnim (AnimTest.AnimTestCase) ... ok
testLinearAnimZeroDuration (AnimTest.AnimTestCase) ... ok
testPingPongStopAnim (AnimTest.AnimTestCase) ... ok
testPointAnim (AnimTest.AnimTestCase) ... ok
testXPosPointAnim (AnimTest.AnimTestCase) ... ok
testYPosPointAnim (AnimTest.AnimTestCase) ... ok
testEaseInOutAnim (AnimTest.AnimTestCase) ... ok
testColorAnim (AnimTest.AnimTestCase) ... ok
testIntAnim (AnimTest.AnimTestCase) ... ok
testContinuousAnim (AnimTest.AnimTestCase) ... ok
testWaitAnim (AnimTest.AnimTestCase) ... ok
testParallelAnim (AnimTest.AnimTestCase) ... ok
testParallelAnimRegistry (AnimTest.AnimTestCase) ... ok
testStateAnim (AnimTest.AnimTestCase) ... ok
testStateAnimRegistry (AnimTest.AnimTestCase) ... ok
testNonNodeAttrAnim (AnimTest.AnimTestCase) ... ok
testKeyboard (WidgetTest.WidgetTestCase) ... ok
testTextArea (WidgetTest.WidgetTestCase) ... ok
testButton (WidgetTest.WidgetTestCase) ... ok
testTextButton (WidgetTest.WidgetTestCase) ...
testTextButtonDown: Difference image has avg=0.67, std dev=9.36
testTextButtonUp: Difference image has avg=0.75, std dev=10.52
testTextButtonDisabled: Difference image has avg=0.75, std dev=10.52
testTextButtonUpNewText: Difference image has avg=1.17, std dev=11.04
testTextButtonDownNewText: Difference image has avg=1.04, std dev=9.83
ok
testToggleButton (WidgetTest.WidgetTestCase) ... ok
testCheckBox (WidgetTest.WidgetTestCase) ...
testUICheckBoxUnchecked_Up: Difference image has avg=2.55, std dev=20.29
testUICheckBoxUnchecked_Down: Difference image has avg=2.55, std dev=20.29
testUICheckBoxChecked_Up: Difference image has avg=2.55, std dev=20.29
testUICheckBoxChecked_Down: Difference image has avg=2.55, std dev=20.29
testUICheckBoxUnchecked_Up: Difference image has avg=2.55, std dev=20.29
testUICheckBoxUnchecked_Disabled: Difference image has avg=1.87, std dev=14.88
testUICheckBoxUnchecked_Up: Difference image has avg=2.55, std dev=20.29
testUICheckBoxUnchecked_Down: Difference image has avg=2.55, std dev=20.29
ok
testScrollPane (WidgetTest.WidgetTestCase) ... ok
testStretchNode (WidgetTest.WidgetTestCase) ... ok
testHVStretchNode (WidgetTest.WidgetTestCase) ... ok
testSlider (WidgetTest.WidgetTestCase) ...
Slider, Horiz
TimeSlider, Horiz
Slider, Vert
TimeSlider, Vert
ok
testScrollBar (WidgetTest.WidgetTestCase) ... ok
testProgressBar (WidgetTest.WidgetTestCase) ... ok
testMediaControl (WidgetTest.WidgetTestCase) ...
testMediaControl1: Difference image has avg=1.56, std dev=15.38
testMediaControl2: Difference image has avg=1.56, std dev=15.38
testMediaControl3: Difference image has avg=1.74, std dev=16.35
testMediaControl4: Difference image has avg=1.56, std dev=15.38
testMediaControl5: Difference image has avg=1.56, std dev=15.38
testMediaControl4: Difference image has avg=1.56, std dev=15.38
testMediaControl4: Difference image has avg=1.89, std dev=15.91
ok
testScrollArea (WidgetTest.WidgetTestCase) ... ok
testScrollAreaCustomSkin (WidgetTest.WidgetTestCase) ... ok
testCustomMediaDir (WidgetTest.WidgetTestCase) ... ok
testTapRecognizer (GestureTest.GestureTestCase) ... ok
testHoldRecognizer (GestureTest.GestureTestCase) ... ok
testDoubletapRecognizer (GestureTest.GestureTestCase) ... ok
testSwipeRecognizer (GestureTest.GestureTestCase) ... ok
testSwipeRecognizerTwoFingers (GestureTest.GestureTestCase) ... ok
testDragRecognizer (GestureTest.GestureTestCase) ...
Simple drag, no inertia
Simple drag, inertia
Drag with constraint, no inertia
Drag with constraint, inertia
Down during inertia
Delete during inertia
Root node recognizer
Down during inertia, constrained recognizer
Abort in possible handler, no inertia
Abort in possible handler, inertia
ok
testDragRecognizerRelCoords (GestureTest.GestureTestCase) ... ok
testDragRecognizerInitialEvent (GestureTest.GestureTestCase) ... ok
testDragRecognizerCoordSysNode (GestureTest.GestureTestCase) ... ok
testDragRecognizerCoordSysNodeParentUnlink (GestureTest.GestureTestCase) ... ok
testDragRecognizerMinDist (GestureTest.GestureTestCase) ... ok
testTransformRecognizer (GestureTest.GestureTestCase) ... ok
testTwoRecognizers (GestureTest.GestureTestCase) ... ok
testKMeans (GestureTest.GestureTestCase) ... ok
testMat3x3 (GestureTest.GestureTestCase) ... ok
testRemoveSink (LoggerTest.LoggerTestCase) ... ok
testConfigureCategory (LoggerTest.LoggerTestCase) ... ok
testReconfigureCategory (LoggerTest.LoggerTestCase) ... ok
testOmitCategory (LoggerTest.LoggerTestCase) ... ok
testLogCategory (LoggerTest.LoggerTestCase) ... ok
testUnknownCategoryWarning (LoggerTest.LoggerTestCase) ... ok
testSettingsOptions (AppTest.AppTestCase) ... ok
testSettingsTypes (AppTest.AppTestCase) ... ok
testSettingsSet (AppTest.AppTestCase) ... ok
testSettingsHasOption (AppTest.AppTestCase) ... ok
testSettingsArgvExtender (AppTest.AppTestCase) ... ok
testSettingsKargsExtender (AppTest.AppTestCase) ... ok
testAppAdditionalSettings (AppTest.AppTestCase) ... ok
testAppRuntimeSettings (AppTest.AppTestCase) ... ok
testAppRuntimeSettingsFail (AppTest.AppTestCase) ... ok
testAppInstance (AppTest.AppTestCase) ... ok
testAppResolution (AppTest.AppTestCase) ... ok
testAppDefaultWindowSize (AppTest.AppTestCase) ... ok
testAppFullscreen (AppTest.AppTestCase) ... ok
testAppRotation (AppTest.AppTestCase) ... ok
testScreenshot (AppTest.AppTestCase) ... ok
testKeyboardManagerKeyname (AppTest.AppTestCase) ... ok
testKeyboardManagerScancode (AppTest.AppTestCase) ... ok
testKeyboardManagerText (AppTest.AppTestCase) ... ok
testColorNodePlugin (PluginTest.PluginTestCase) ... ok
testMultiWindowBase (MultiWindowTest.MultiWindowTestCase) ... ok
testMultiWindowApp (MultiWindowTest.MultiWindowTestCase) ... ok
testMultiWindowCanvas (MultiWindowTest.MultiWindowTestCase) ... ok
testMultiWindowManualCanvas (MultiWindowTest.MultiWindowTestCase) ... ok
testMultiWindowFX (MultiWindowTest.MultiWindowTestCase) ... ok
testMultiWindowFXWords (MultiWindowTest.MultiWindowTestCase) ... ok

======================================================================
FAIL: testCanvasMultisampling (OffscreenTest.OffscreenTestCase)
----------------------------------------------------------------------
Traceback (most recent call last):
File "/home/hood/KP/libavg/build/python/libavg/test/OffscreenTest.py", line 398, in testCanvasMultisampling
lambda: self.assertRaises(avg.Exception, lambda: testIllegalSamples(0)),
File "../../libavg/testcase.py", line 141, in start
player.play()
File "../../libavg/testcase.py", line 271, in __nextAction
action()
File "/home/hood/KP/libavg/build/python/libavg/test/OffscreenTest.py", line 395, in <lambda>
lambda: self.compareImage("testCanvasMultisample"),
File "../../libavg/testcase.py", line 152, in compareImage
self.compareBitmapToFile(bmp, fileName)
File "../../libavg/testcase.py", line 179, in compareBitmapToFile
self.fail(msg)
AssertionError: testCanvasMultisample: Difference image has avg=0.50, std dev=7.68

----------------------------------------------------------------------
Ran 284 tests in 6.709s

FAILED (failures=1)
Skipped 1 tests:

mpeg1-48x48.mov
mjpeg-48x48.avi
rgba-48x48.mov
testHinting (WordsTest.WordsTestCase): Linux support requires modified font config
Start 2: testbase
2/7 Test #2: testbase ......................... Passed 1.07 sec
Start 3: testgraphics
3/7 Test #3: testgraphics ..................... Passed 0.10 sec
Start 4: testgpu
4/7 Test #4: testgpu .......................... Passed 0.39 sec
Start 5: testlimiter
5/7 Test #5: testlimiter ...................... Passed 0.00 sec
Start 6: testvideo
6/7 Test #6: testvideo ........................ Passed 0.69 sec
Start 7: testplayer
7/7 Test #7: testplayer ....................... Passed 0.16 sec

86% tests passed, 1 tests failed out of 7

Total Test time (real) = 10.35 sec

The following tests FAILED:
1 - python_test (Failed)
Errors while running CTest
CMakeFiles/check.dir/build.make:57: recipe for target 'CMakeFiles/check' failed
make3: * [CMakeFiles/check] Error 8
CMakeFiles/Makefile2:67: recipe for target 'CMakeFiles/check.dir/all' failed
make2:
[CMakeFiles/check.dir/all] Error 2
CMakeFiles/Makefile2:74: recipe for target 'CMakeFiles/check.dir/rule' failed
make1:
[CMakeFiles/check.dir/rule] Error 2
Makefile:173: recipe for target 'check' failed
make: *
[check] Error 2

RE: A test failure - Added by coder 8 months ago

libavg should work fine on your machine. The error is just a slight rendering inaccuracy in one of 284 rendering tests.

Cheers, Uli

(1-3/3)